{"text_format":"1","workbook":"xlsx","n_sheets":5,"sheets":["概要記入ｼｰﾄ","測定値入力シート","600秒時の吸水速度計算結果","Sheet1","計算600秒①"],"not_rendered":{"charts":2,"images":0,"macros":1,"external_links":0,"defined_names":3,"comments":0,"pivot_tables":0},"unopened":[],"bounds":{"document_bytes":16777216,"sheet_cells":100000,"rows_first":2000,"rows_last":500,"rows_between":2000,"halvings":0,"cell_chars":16384,"cell_head_chars":4096},"cells_cut":0,"cells_raw":0,"read":"whole","date_system":"1900"}

{"sheet":"概要記入ｼｰﾄ","index":0,"n_rows":13,"n_cols":3,"rows_kept":13,"cut":false,"hidden":false,"merged":[]}
[null,"概要記入シート"]
[]
[null,"測定者：","練習"]
[null,"測定日時：","2024-12-20"]
[null,"構造物名：","練習"]
[null,"測定箇所：","練習"]
[null,"箇所番号：","No1"]
[null,"天　候：","晴れ"]
[null,"気　温：",20]
[null,"湿　度：",40]
[null,"前日の雨の有無：","有"]
[null,"試験水の温度：",20]
[null,"ｺﾝｸﾘｰﾄ含水率：",4.5]

{"sheet":"測定値入力シート","index":1,"n_rows":289,"n_cols":33,"rows_kept":289,"cut":false,"hidden":false,"merged":[[137,1,137,3],[137,4,137,6],[138,1,138,3],[138,4,138,6],[139,1,139,3],[139,4,139,6],[132,1,132,3],[132,4,132,6],[133,1,133,3],[133,4,133,6],[134,1,134,3],[134,4,134,6],[135,1,135,3],[135,4,135,6],[136,1,136,3],[136,4,136,6],[127,1,127,3],[127,4,127,6],[128,1,128,3],[128,4,128,6],[129,1,129,3],[129,4,129,6],[130,1,130,3],[130,4,130,6],[131,1,131,3],[131,4,131,6],[20,44,20,46],[20,47,20,49],[21,44,21,46],[21,47,21,49],[22,44,22,46],[22,47,22,49],[23,44,23,46],[23,47,23,49],[126,1,126,3],[126,4,126,6],[48,0,48,11],[49,0,49,11],[38,9,38,11],[39,9,39,11],[45,0,45,11],[46,0,46,11],[47,0,47,11],[42,9,42,11],[43,0,43,2],[43,3,43,5],[43,6,43,8],[43,9,43,11],[40,0,40,2],[40,3,40,5],[15,44,15,46],[15,47,15,49],[16,44,16,46],[16,47,16,49],[17,44,17,46],[17,47,17,49],[18,44,18,46],[18,47,18,49],[19,44,19,46],[19,47,19,49],[10,44,10,46],[10,47,10,49],[11,44,11,46],[11,47,11,49],[12,44,12,46],[12,47,12,49],[13,44,13,46],[13,47,13,49],[14,44,14,46],[14,47,14,49],[0,0,1,5],[2,0,2,1],[8,0,8,2],[8,3,8,5],[10,0,10,2],[10,3,10,5],[42,0,42,2],[42,3,42,5],[42,6,42,8],[38,0,38,2],[38,3,38,5],[38,6,38,8],[34,0,34,2],[34,3,34,5],[34,6,34,8],[30,0,30,2],[30,3,30,5],[30,6,30,8],[26,0,26,2],[6,2,6,5],[39,0,39,2],[39,3,39,5],[39,6,39,8],[36,0,36,2],[40,6,40,8],[40,9,40,11],[41,0,41,2],[41,3,41,5],[41,6,41,8],[41,9,41,11],[36,3,36,5],[36,6,36,8],[36,9,36,11],[37,0,37,2],[37,3,37,5],[37,6,37,8],[37,9,37,11],[34,9,34,11],[35,0,35,2],[35,3,35,5],[35,6,35,8],[35,9,35,11],[32,0,32,2],[32,3,32,5],[32,6,32,8],[32,9,32,11],[33,0,33,2],[33,3,33,5],[33,6,33,8],[33,9,33,11],[30,9,30,11],[31,0,31,2],[31,3,31,5],[31,6,31,8],[31,9,31,11],[28,0,28,2],[28,3,28,5],[28,6,28,8],[28,9,28,11],[29,0,29,2],[29,3,29,5],[29,6,29,8],[29,9,29,11],[26,9,26,11],[27,0,27,2],[27,3,27,5],[27,6,27,8],[27,9,27,11],[26,3,26,5],[26,6,26,8],[24,0,24,2],[24,3,24,5],[24,6,24,8],[24,9,24,11],[25,0,25,2],[25,3,25,5],[25,6,25,8],[25,9,25,11],[22,9,22,11],[23,0,23,2],[23,3,23,5],[23,6,23,8],[23,9,23,11],[22,0,22,2],[22,3,22,5],[22,6,22,8],[20,0,20,2],[20,3,20,5],[20,6,20,8],[20,9,20,11],[21,0,21,2],[21,3,21,5],[21,6,21,8],[21,9,21,11],[18,0,18,2],[18,3,18,5],[18,6,18,8],[18,9,18,11],[19,0,19,2],[19,3,19,5],[19,6,19,8],[19,9,19,11],[16,0,16,2],[16,3,16,5],[16,6,16,8],[16,9,16,11],[17,0,17,2],[17,3,17,5],[17,6,17,8],[17,9,17,11],[14,0,14,2],[14,3,14,5],[14,6,14,8],[14,9,14,11],[15,0,15,2],[15,3,15,5],[15,6,15,8],[15,9,15,11],[12,3,12,5],[12,6,12,8],[12,9,12,11],[13,0,13,2],[13,3,13,5],[13,6,13,8],[13,9,13,11],[12,0,12,2],[11,9,11,11],[8,6,8,8],[8,9,8,11],[9,0,9,2],[9,3,9,5],[9,6,9,8],[9,9,9,11],[10,6,10,8],[10,9,10,11],[4,0,4,1],[4,2,4,5],[4,6,4,7],[4,8,4,11],[3,0,3,1],[3,2,3,5],[6,6,6,7],[6,8,6,11],[6,0,6,1],[5,0,5,1],[99,15,99,16],[100,13,100,14],[89,15,89,16],[90,13,90,14],[47,13,47,16],[1,6,1,7],[1,8,1,11],[2,2,2,5],[2,6,2,7],[2,8,2,11],[45,13,45,16],[46,13,46,16],[2,13,2,14],[1,15,1,16],[43,13,43,16],[44,13,44,16],[5,6,5,7],[5,8,5,11],[5,2,5,5],[3,6,3,7],[3,8,3,11],[11,0,11,2],[11,3,11,5],[11,6,11,8]]}
["表面吸水試験 測定値入力シート",null,null,null,null,null,null,null,null,null,null,null,null,"現場透水量試験記録","①","②","③","④","⑤","⑥","⑦","⑧","⑨","⑩","⑪","⑫","⑬","⑭","⑮","⑯","⑰","⑱","⑲"]
[null,null,null,null,null,null,"測定者：",null,{"$f":"IF(概要記入ｼｰﾄ!C3=\"\",\"－\",概要記入ｼｰﾄ!C3)","v":"練習"},null,null,null,null,"構造物名：構造物A",null,"箇所番号：箇所番号1"]
["構造物名：",null,{"$f":"IF(概要記入ｼｰﾄ!C5=\"\",\"－\",概要記入ｼｰﾄ!C5)","v":"練習"},null,null,null,"測定日時：",null,{"$f":"IF(概要記入ｼｰﾄ!C4=\"\",\"－\",概要記入ｼｰﾄ!C4)","v":"2024-12-20"},null,null,null,null,"測定箇所：測定箇所①",null,"試験水の温度：20℃","ｺﾝｸﾘｰﾄ含水率：4.5％"]
["測定箇所：",null,{"$f":"IF(概要記入ｼｰﾄ!C6=\"\",\"－\",概要記入ｼｰﾄ!C6)","v":"練習"},null,null,null,"箇所番号：",null,{"$f":"IF(概要記入ｼｰﾄ!C7=\"\",\"－\",概要記入ｼｰﾄ!C7)","v":"No1"},null,null,null,null,"測定日時：2017/09/12","測定者：測定者①","試験種類：","塗布前"]
["天　候：",null,{"$f":"IF(概要記入ｼｰﾄ!C8=\"\",\"－\",概要記入ｼｰﾄ!C8)","v":"晴れ"},null,null,null,"前日の雨の有無：",null,{"$f":"IF(概要記入ｼｰﾄ!C11=\"\",\"－\",概要記入ｼｰﾄ!C11)","v":"有"},null,null,null,null,"天候：晴れ","前日の雨の有無：無","表面含浸工の施工有無：有"]
["気　温(℃)　　　：",null,{"$f":"IF(概要記入ｼｰﾄ!C9=\"\",\"－\",概要記入ｼｰﾄ!C9)","v":20},null,null,null,"湿　度(％)　　：",null,{"$f":"IF(概要記入ｼｰﾄ!C10=\"\",\"－\",概要記入ｼｰﾄ!C10)","v":40},null,null,null,null,"気温：20℃","湿度：60％+","含浸剤の種類：シラン系"]
["試験水の温度(℃)：",null,{"$f":"IF(概要記入ｼｰﾄ!C12=\"\",\"－\",概要記入ｼｰﾄ!C12)","v":20},null,null,null,"ｺﾝｸﾘｰﾄ含水率(％)：",null,{"$f":"IF(概要記入ｼｰﾄ!C13=\"\",\"－\",概要記入ｼｰﾄ!C13)","v":4.5},null,null,null,null,"測定時間","測定時間","測定値","追加\n給水量","追加\n給水量\n（累積）","吸水量\n（累積）",null,null,"⑦","A","⑤","⑧⑨","⑧⑩",null,null,"⑦","⑪⑫⑭","⑪⑫⑭","⑮⑯","⑮⑰"]
[null,null,null,null,null,null,null,null,null,null,null,null,null,"秒","分","ｍｌ","ｍｌ","ｍｌ","ｍｌ",null,"番号"]
["測定時間",null,null,"測定時間",null,null,"測定値",null,null,"追加\n給水量",null,null,null,0,"00:00:00",{"$f":"IF(G11=\"\",\"\",G11)","v":0},{"$f":"IF(J11=\"\",0,J11)","v":0},0,{"$f":"IF(P9=\"\",\"\",P9+R9)","v":0},null,0,0,0,{"$f":"N9","v":0},0,0,null,0,0,0,0,0,0]
["秒",null,null,"分",null,null,"ｍｌ",null,null,"ｍｌ",null,null,null,15,"05:00:15",{"$f":"IF(G12=\"\",\"\",G12)","v":0},{"$f":"IF(J12=\"\",0,J12)","v":0},{"$f":"R9+Q10","v":0},{"$f":"IF(P10=\"\",\"\",P10+R10)","v":0},null,1,{"$f":"IF(P10=\"\",\"\",U10)","v":1},{"$f":"IF(P10=\"\",\"\",N10)","v":15},{"$f":"IF(P10=\"\",\"\",S10)","v":0},{"$f":"IF(COUNT(V$10:V$42)<ROW(W1),\"\",INDEX(W$10:W$42,SMALL(V$10:V$42,ROW(W1))))","v":15},{"$f":"IF(COUNT(V$10:V$42)<ROW(X1),\"\",INDEX(X$10:X$42,SMALL(V$10:V$42,ROW(X1))))","v":0},null,15,{"$f":"IF(AD10=\"\",\"\",U10)","v":""},{"$f":"IF(AE10=\"\",\"\",IF(ISERROR(VLOOKUP(AB10,$Y$10:$Z$42,1,0)),\"\",VLOOKUP(AB10,$Y$10:$Z$42,1,0)))","v":""},{"$f":"IF(IF(ISERROR(VLOOKUP(AB10,$Y$10:$Z$42,2,0)),\"\",VLOOKUP(AB10,$Y$10:$Z$42,2,0))=0,\"\",IF(ISERROR(VLOOKUP(AB10,$Y$10:$Z$42,2,0)),\"\",VLOOKUP(AB10,$Y$10:$Z$42,2,0)))","v":""},{"$f":"IF(COUNT(AC$10:AC$42)<ROW(AD1),\"\",INDEX(AD$10:AD$42,SMALL(AC$10:AC$42,ROW(AD1))))","v":60},{"$f":"IF(COUNT(AC$10:AC$42)<ROW(AE1),\"\",INDEX(AE$10:AE$42,SMALL(AC$10:AC$42,ROW(AE1))))","v":0.65}]
[0,null,null,"00:00:00",null,null,0,null,null,null,null,null,null,30,"06:00:30",0,0,{"$f":"R10+Q11","v":0},{"$f":"IF(P11=\"\",\"\",P11+R11)","v":0},null,2,{"$f":"IF(P11=\"\",\"\",U11)","v":2},30,{"$f":"IF(P11=\"\",\"\",S11)","v":0},{"$f":"IF(COUNT(V$10:V$42)<ROW(W2),\"\",INDEX(W$10:W$42,SMALL(V$10:V$42,ROW(W2))))","v":30},{"$f":"IF(COUNT(V$10:V$42)<ROW(X2),\"\",INDEX(X$10:X$42,SMALL(V$10:V$42,ROW(X2))))","v":0},null,30,{"$f":"IF(AD11=\"\",\"\",U11)","v":""},{"$f":"IF(AE11=\"\",\"\",IF(ISERROR(VLOOKUP(AB11,$Y$10:$Z$42,1,0)),\"\",VLOOKUP(AB11,$Y$10:$Z$42,1,0)))","v":""},{"$f":"IF(IF(ISERROR(VLOOKUP(AB11,$Y$10:$Z$42,2,0)),\"\",VLOOKUP(AB11,$Y$10:$Z$42,2,0))=0,\"\",IF(ISERROR(VLOOKUP(AB11,$Y$10:$Z$42,2,0)),\"\",VLOOKUP(AB11,$Y$10:$Z$42,2,0)))","v":""},{"$f":"IF(COUNT(AC$10:AC$42)<ROW(AD2),\"\",INDEX(AD$10:AD$42,SMALL(AC$10:AC$42,ROW(AD2))))","v":120},{"$f":"IF(COUNT(AC$10:AC$42)<ROW(AE2),\"\",INDEX(AE$10:AE$42,SMALL(AC$10:AC$42,ROW(AE2))))","v":0.9}]
[15,null,null,"05:00:15",null,null,0,null,null,null,null,null,null,45,"07:00:45",0,0,0,0,null,3,{"$f":"IF(P12=\"\",\"\",U12)","v":3},{"$f":"IF(P12=\"\",\"\",N12)","v":45},{"$f":"IF(P12=\"\",\"\",S12)","v":0},{"$f":"IF(COUNT(V$10:V$42)<ROW(W3),\"\",INDEX(W$10:W$42,SMALL(V$10:V$42,ROW(W3))))","v":45},{"$f":"IF(COUNT(V$10:V$42)<ROW(X3),\"\",INDEX(X$10:X$42,SMALL(V$10:V$42,ROW(X3))))","v":0},null,45,{"$f":"IF(AD12=\"\",\"\",U12)","v":""},"","",{"$f":"IF(COUNT(AC$10:AC$42)<ROW(AD3),\"\",INDEX(AD$10:AD$42,SMALL(AC$10:AC$42,ROW(AD3))))","v":180},1.05]
[30,null,null,"06:00:30",null,null,0,null,null,null,null,null,null,60,"05:01:00",0.65,0,0,0.65,null,4,4,60,{"$f":"IF(P13=\"\",\"\",S13)","v":0.65},{"$f":"IF(COUNT(V$10:V$42)<ROW(W4),\"\",INDEX(W$10:W$42,SMALL(V$10:V$42,ROW(W4))))","v":60},0.65,null,60,{"$f":"IF(AD13=\"\",\"\",U13)","v":4},60,0.65,240,1.18]
[45,null,null,"07:00:45",null,null,0,null,null,null,null,null,null,120,"06:02:00",0.9,0,0,0.9,null,5,5,120,0.9,120,0.9,null,120,5,120,0.9,300,1.3]
[60,null,null,"05:01:00",null,null,0.65,null,null,null,null,null,null,180,"07:03:00",0.05,1,1,1.05,null,6,6,180,1.05,180,1.05,null,180,6,180,1.05,360,1.4]
[120,null,null,"05:02:00",null,null,0.9,null,null,null,null,null,null,240,"08:04:00",0.18,0,1,1.18,null,7,7,240,1.18,240,1.18,null,240,7,240,1.18,420,1.48]
[180,null,null,"05:03:00",null,null,0.05,null,null,1,null,null,null,300,"09:05:00",0.3,0,1,1.3,null,8,8,300,1.3,300,1.3,null,300,8,300,1.3,480,1.5699999999999998]
[240,null,null,"05:04:00",null,null,0.18,null,null,null,null,null,null,360,"10:06:00",0.4,0,1,1.4,null,9,9,{"$f":"IF(P18=\"\",\"\",N18)","v":360},1.4,360,1.4,null,360,9,360,1.4,540,1.67]
[300,null,null,"05:05:00",null,null,0.3,null,null,null,null,null,null,420,"11:07:00",0.48,0,1,1.48,null,10,{"$f":"IF(P19=\"\",\"\",U19)","v":10},420,1.48,{"$f":"IF(COUNT(V$10:V$42)<ROW(W10),\"\",INDEX(W$10:W$42,SMALL(V$10:V$42,ROW(W10))))","v":420},1.48,null,420,10,420,1.48,600,1.75]
[360,null,null,"05:06:00",null,null,0.4,null,null,null,null,null,null,480,"12:08:00",0.56999999999999995,0,1,1.5699999999999998,null,11,11,480,1.5699999999999998,480,1.5699999999999998,null,480,11,480,1.5699999999999998,"",""]
{"$rows_left_out":270}
{"sheet":"600秒時の吸水速度計算結果","index":2,"n_rows":51,"n_cols":14,"rows_kept":51,"cut":false,"hidden":false,"merged":[[50,0,50,9],[5,7,5,9],[6,7,6,9],[46,6,46,9],[47,6,47,9],[48,6,48,9],[45,0,45,9],[46,1,46,4],[6,5,6,6],[5,0,5,1],[6,0,6,1],[5,5,5,6],[44,4,44,9],[5,2,5,4],[6,2,6,4],[22,4,22,9],[1,7,1,9],[2,7,2,9],[3,7,3,9],[4,7,4,9],[0,0,0,9],[1,5,1,6],[4,0,4,1],[2,0,2,1],[3,0,3,1],[2,5,2,6],[3,5,3,6],[4,5,4,6],[2,2,2,4],[3,2,3,4],[4,2,4,4],[20,4,21,9],[40,4,41,9],[17,4,17,9],[18,4,18,9],[39,4,39,9],[49,0,49,2],[49,3,49,5],[48,1,48,4],[47,1,47,4],[49,6,49,9]]}
["表面吸水試験によるコンクリート表層品質の評価結果"]
[null,null,null,null,null,"測定者：",null,{"$f":"測定値入力シート!I2","v":"練習"}]
["構造物名：",null,{"$f":"測定値入力シート!C3","v":"練習"},null,null,"測定日時：",null,{"$f":"測定値入力シート!I3","v":"2024-12-20"}]
["測定箇所：",null,{"$f":"測定値入力シート!C4","v":"練習"},null,null,"箇所番号：",null,{"$f":"測定値入力シート!I4","v":"No1"}]
["天　候：",null,{"$f":"測定値入力シート!C5","v":"晴れ"},null,null,"前日の雨の有無：",null,{"$f":"測定値入力シート!I5","v":"有"}]
["気　温(℃)         ：",null,{"$f":"測定値入力シート!C6","v":20},null,null,"湿　度(%)：",null,{"$f":"測定値入力シート!I6","v":40}]
["試験水の温度(℃)：",null,{"$f":"測定値入力シート!C7","v":20},null,null,"ｺﾝｸﾘｰﾄ含水率(%)：",null,{"$f":"測定値入力シート!I7","v":4.5}]
[]
["測定時間","実測累積\n吸水量","単位面積\n当たりの\n累積吸水量","吸水速度"]
["秒","ｍｌ","ml/m2","ml/m2/sec"]
[0,0,0,null,null,null,"吸水速度（ml/m²/s)",null,null,null,null,{"$f":"A11","v":0},0,0]
[15,{"$f":"IF(測定値入力シート!G12=0,0,IF(ISERROR(VLOOKUP(A12,計算600秒①!$D$5:'計算600秒①'!$J$37,2,0)),NA(),VLOOKUP(A12,計算600秒①!$D$5:'計算600秒①'!$J$37,2,0)))","v":0},{"$f":"IF(B12=0,0,IF(ISERROR(VLOOKUP(A12,計算600秒①!$D$5:'計算600秒①'!$J$37,3,0)),NA(),VLOOKUP(A12,計算600秒①!$D$5:'計算600秒①'!$J$37,3,0)))","v":0},{"$f":"IF(ISERROR(VLOOKUP(A12,計算600秒①!$D$5:'計算600秒①'!$J$37,7,0)),NA(),VLOOKUP(A12,計算600秒①!$D$5:'計算600秒①'!$J$37,7,0))","v":{"$error":"#N/A"}},null,null,"実測累積吸水量（ml)",null,null,null,null,{"$f":"A12","v":15},{"$f":"IF(B12=0,NA(),B12)","v":{"$error":"#N/A"}},{"$f":"IF(C12=0,NA(),C12)","v":{"$error":"#N/A"}}]
[30,{"$f":"IF(測定値入力シート!G13=0,0,IF(ISERROR(VLOOKUP(A13,計算600秒①!$D$5:'計算600秒①'!$J$37,2,0)),NA(),VLOOKUP(A13,計算600秒①!$D$5:'計算600秒①'!$J$37,2,0)))","v":0},{"$f":"IF(B13=0,0,IF(ISERROR(VLOOKUP(A13,計算600秒①!$D$5:'計算600秒①'!$J$37,3,0)),NA(),VLOOKUP(A13,計算600秒①!$D$5:'計算600秒①'!$J$37,3,0)))","v":0},{"$f":"IF(ISERROR(VLOOKUP(A13,計算600秒①!$D$5:'計算600秒①'!$J$37,7,0)),NA(),VLOOKUP(A13,計算600秒①!$D$5:'計算600秒①'!$J$37,7,0))","v":{"$error":"#N/A"}},null,null,"1m ²当たりの累積吸水量（ml)",null,null,null,null,30,{"$f":"IF(B13=0,NA(),B13)","v":{"$error":"#N/A"}},{"$f":"IF(C13=0,NA(),C13)","v":{"$error":"#N/A"}}]
[45,{"$f":"IF(測定値入力シート!G14=0,0,IF(ISERROR(VLOOKUP(A14,計算600秒①!$D$5:'計算600秒①'!$J$37,2,0)),NA(),VLOOKUP(A14,計算600秒①!$D$5:'計算600秒①'!$J$37,2,0)))","v":0},{"$f":"IF(B14=0,0,IF(ISERROR(VLOOKUP(A14,計算600秒①!$D$5:'計算600秒①'!$J$37,3,0)),NA(),VLOOKUP(A14,計算600秒①!$D$5:'計算600秒①'!$J$37,3,0)))","v":0},{"$f":"IF(ISERROR(VLOOKUP(A14,計算600秒①!$D$5:'計算600秒①'!$J$37,7,0)),NA(),VLOOKUP(A14,計算600秒①!$D$5:'計算600秒①'!$J$37,7,0))","v":{"$error":"#N/A"}},null,null,null,null,null,null,null,45,{"$error":"#N/A"},{"$error":"#N/A"}]
[60,{"$f":"IF(測定値入力シート!G15=0,0,IF(ISERROR(VLOOKUP(A15,計算600秒①!$D$5:'計算600秒①'!$J$37,2,0)),NA(),VLOOKUP(A15,計算600秒①!$D$5:'計算600秒①'!$J$37,2,0)))","v":0.65},{"$f":"IF(B15=0,0,IF(ISERROR(VLOOKUP(A15,計算600秒①!$D$5:'計算600秒①'!$J$37,3,0)),NA(),VLOOKUP(A15,計算600秒①!$D$5:'計算600秒①'!$J$37,3,0)))","v":129.31339126216497},{"$f":"IF(ISERROR(VLOOKUP(A15,計算600秒①!$D$5:'計算600秒①'!$J$37,7,0)),NA(),VLOOKUP(A15,計算600秒①!$D$5:'計算600秒①'!$J$37,7,0))","v":0.92},null,null,null,null,null,null,null,60,0.65,129.31339126216497]
[120,{"$f":"IF(測定値入力シート!G16=0,0,IF(ISERROR(VLOOKUP(A16,計算600秒①!$D$5:'計算600秒①'!$J$37,2,0)),NA(),VLOOKUP(A16,計算600秒①!$D$5:'計算600秒①'!$J$37,2,0)))","v":0.9},{"$f":"IF(B16=0,0,IF(ISERROR(VLOOKUP(A16,計算600秒①!$D$5:'計算600秒①'!$J$37,3,0)),NA(),VLOOKUP(A16,計算600秒①!$D$5:'計算600秒①'!$J$37,3,0)))","v":179.04931097838227},{"$f":"IF(ISERROR(VLOOKUP(A16,計算600秒①!$D$5:'計算600秒①'!$J$37,7,0)),NA(),VLOOKUP(A16,計算600秒①!$D$5:'計算600秒①'!$J$37,7,0))","v":0.62},null,null,null,null,null,null,null,120,0.9,179.04931097838227]
[180,{"$f":"IF(測定値入力シート!G17=0,0,IF(ISERROR(VLOOKUP(A17,計算600秒①!$D$5:'計算600秒①'!$J$37,2,0)),NA(),VLOOKUP(A17,計算600秒①!$D$5:'計算600秒①'!$J$37,2,0)))","v":1.05},{"$f":"IF(B17=0,0,IF(ISERROR(VLOOKUP(A17,計算600秒①!$D$5:'計算600秒①'!$J$37,3,0)),NA(),VLOOKUP(A17,計算600秒①!$D$5:'計算600秒①'!$J$37,3,0)))","v":208.89086280811264},{"$f":"IF(ISERROR(VLOOKUP(A17,計算600秒①!$D$5:'計算600秒①'!$J$37,7,0)),NA(),VLOOKUP(A17,計算600秒①!$D$5:'計算600秒①'!$J$37,7,0))","v":0.49},null,null,null,null,null,null,null,180,1.05,208.89086280811264]
[240,{"$f":"IF(測定値入力シート!G18=0,0,IF(ISERROR(VLOOKUP(A18,計算600秒①!$D$5:'計算600秒①'!$J$37,2,0)),NA(),VLOOKUP(A18,計算600秒①!$D$5:'計算600秒①'!$J$37,2,0)))","v":1.18},{"$f":"IF(B18=0,0,IF(ISERROR(VLOOKUP(A18,計算600秒①!$D$5:'計算600秒①'!$J$37,3,0)),NA(),VLOOKUP(A18,計算600秒①!$D$5:'計算600秒①'!$J$37,3,0)))","v":234.75354106054561},{"$f":"IF(ISERROR(VLOOKUP(A18,計算600秒①!$D$5:'計算600秒①'!$J$37,7,0)),NA(),VLOOKUP(A18,計算600秒①!$D$5:'計算600秒①'!$J$37,7,0))","v":0.41},null,null,null,null,null,null,null,240,1.18,234.75354106054561]
[300,{"$f":"IF(測定値入力シート!G19=0,0,IF(ISERROR(VLOOKUP(A19,計算600秒①!$D$5:'計算600秒①'!$J$37,2,0)),NA(),VLOOKUP(A19,計算600秒①!$D$5:'計算600秒①'!$J$37,2,0)))","v":1.3},{"$f":"IF(B19=0,0,IF(ISERROR(VLOOKUP(A19,計算600秒①!$D$5:'計算600秒①'!$J$37,3,0)),NA(),VLOOKUP(A19,計算600秒①!$D$5:'計算600秒①'!$J$37,3,0)))","v":258.62678252432994},{"$f":"IF(ISERROR(VLOOKUP(A19,計算600秒①!$D$5:'計算600秒①'!$J$37,7,0)),NA(),VLOOKUP(A19,計算600秒①!$D$5:'計算600秒①'!$J$37,7,0))","v":0.36},null,null,null,null,null,null,null,300,1.3,258.62678252432994]
[360,{"$f":"IF(測定値入力シート!G20=0,0,IF(ISERROR(VLOOKUP(A20,計算600秒①!$D$5:'計算600秒①'!$J$37,2,0)),NA(),VLOOKUP(A20,計算600秒①!$D$5:'計算600秒①'!$J$37,2,0)))","v":1.4},{"$f":"IF(B20=0,0,IF(ISERROR(VLOOKUP(A20,計算600秒①!$D$5:'計算600秒①'!$J$37,3,0)),NA(),VLOOKUP(A20,計算600秒①!$D$5:'計算600秒①'!$J$37,3,0)))","v":278.52115041081686},{"$f":"IF(ISERROR(VLOOKUP(A20,計算600秒①!$D$5:'計算600秒①'!$J$37,7,0)),NA(),VLOOKUP(A20,計算600秒①!$D$5:'計算600秒①'!$J$37,7,0))","v":0.33},null,null,null,null,null,null,null,360,1.4,278.52115041081686]
{"$rows_left_out":32}
{"sheet":"Sheet1","index":3,"n_rows":0,"n_cols":0,"rows_kept":0,"cut":false,"hidden":true,"merged":[]}

{"sheet":"計算600秒①","index":4,"n_rows":37,"n_cols":15,"rows_kept":37,"cut":false,"hidden":true,"merged":[[0,0,0,1],[1,11,1,14]]}
["前回"]
["測定時間","測定値",null,"測定時間","累積吸水量","1m2当たりの\n累積吸水量","区間\n吸水速度","区間\n測定時間\nlog","区間\n吸水速度\nlog","吸水速度",null,"600秒試験結果"]
["秒","ｍｌ",null,"秒","ｍｌ","ml/m2","ml/m2/sec"," sec","ml/m2/sec","ml/m2/sec",null,"Ｙ＝ＡＸ+Ｂ"]
[{"$f":"IF(測定値入力シート!AF9=\"\",\"\",測定値入力シート!AF9)","v":0},{"$f":"IF(測定値入力シート!AG9=\"\",\"\",測定値入力シート!AG9)","v":0},null,0,0,0,null,null,null,null,null,"A","Ｂ","寄与率Ｒ2","相関係数ｒ"]
[{"$f":"IF(測定値入力シート!AF10=\"\",\"\",測定値入力シート!AF10)","v":60},{"$f":"IF(測定値入力シート!AG10=\"\",\"\",測定値入力シート!AG10)","v":0.65},null,{"$f":"IF(A5=\"\",\"\",A5)","v":60},{"$f":"IF(B5=\"\",\"\",B5)","v":0.65},{"$f":"IF(E5=\"\",\"\",E5/((0.08^2*PI())/4))","v":129.31339126216497},{"$f":"IF(E5=\"\",\"\",F5/D5)","v":2.1552231877027497},{"$f":"IF(E5=\"\",\"\",LOG(D5,10))","v":1.7781512503836434},{"$f":"IF(E5=\"\",\"\",LOG(G5,10))","v":0.33349225090915335},{"$f":"IF(E5=\"\",\"\",ROUND($L$14*D5^(-$M$14),2))","v":0.92},null,{"$f":"SLOPE(I5:I37,H5:H37)","v":-0.57822888034088116},{"$f":"INTERCEPT(I5:I37,H5:H37)","v":1.3673068857530144},{"$f":"RSQ(I5:I37,H5:H37)","v":0.9994881752370236},{"$f":"SQRT(N5)","v":0.99974405486455564}]
[{"$f":"IF(測定値入力シート!AF11=\"\",\"\",測定値入力シート!AF11)","v":120},{"$f":"IF(測定値入力シート!AG11=\"\",\"\",測定値入力シート!AG11)","v":0.9},null,{"$f":"IF(A6=\"\",\"\",A6)","v":120},0.9,179.04931097838227,{"$f":"IF(E6=\"\",\"\",F6/D6)","v":1.492077591486519},2.0791812460476247,{"$f":"IF(E6=\"\",\"\",LOG(G6,10))","v":0.17379140804164145},{"$f":"IF(E6=\"\",\"\",ROUND($L$14*D6^(-$M$14),2))","v":0.62}]
[{"$f":"IF(測定値入力シート!AF12=\"\",\"\",測定値入力シート!AF12)","v":180},{"$f":"IF(測定値入力シート!AG12=\"\",\"\",測定値入力シート!AG12)","v":1.05},null,180,1.05,208.89086280811264,{"$f":"IF(E7=\"\",\"\",F7/D7)","v":1.1605047933784036},{"$f":"IF(E7=\"\",\"\",LOG(D7,10))","v":2.255272505103306},6.4646938616573404E-2,0.49]
[{"$f":"IF(測定値入力シート!AF13=\"\",\"\",測定値入力シート!AF13)","v":240},{"$f":"IF(測定値入力シート!AG13=\"\",\"\",測定値入力シート!AG13)","v":1.18},null,240,1.18,234.75354106054561,0.97813975441894008,2.3802112417116059,-9.5990897555392751E-3,0.41,null,"V＝ｋ*ｔ（-ｍ）"]
[{"$f":"IF(測定値入力シート!AF14=\"\",\"\",測定値入力シート!AF14)","v":300},{"$f":"IF(測定値入力シート!AG14=\"\",\"\",測定値入力シート!AG14)","v":1.3},null,300,1.3,258.62678252432994,0.86208927508109978,2.4771212547196622,-6.4447757762884264E-2,0.36,null,"ｋ","ｍ"]
[{"$f":"IF(測定値入力シート!AF15=\"\",\"\",測定値入力シート!AF15)","v":360},{"$f":"IF(測定値入力シート!AG15=\"\",\"\",測定値入力シート!AG15)","v":1.4},null,360,1.4,278.52115041081686,0.77366986225226908,2.5563025007672873,-0.11144432043910781,0.33,null,{"$f":"10^M5","v":23.297369394705278},{"$f":"-L5","v":0.57822888034088116}]
[{"$f":"IF(測定値入力シート!AF16=\"\",\"\",測定値入力シート!AF16)","v":420},{"$f":"IF(測定値入力シート!AG16=\"\",\"\",測定値入力シート!AG16)","v":1.48},null,420,1.48,294.43664472000637,0.70103963028572946,2.6232492903979003,-0.15425743035300168,0.3]
[{"$f":"IF(測定値入力シート!AF17=\"\",\"\",測定値入力シート!AF17)","v":480},{"$f":"IF(測定値入力シート!AG17=\"\",\"\",測定値入力シート!AG17)","v":1.5699999999999998},null,480,1.5699999999999998,312.34157581784456,0.65071161628717611,2.6812412373755872,-0.18661144031641219,0.28000000000000003]
[{"$f":"IF(測定値入力シート!AF18=\"\",\"\",測定値入力シート!AF18)","v":540},{"$f":"IF(測定値入力シート!AG18=\"\",\"\",測定値入力シート!AG18)","v":1.67},null,540,1.67,332.23594370433153,0.61525174760061396,2.7323937598229686,-0.21094714402544382,0.26,null,"a","n","10min WAF"]
[{"$f":"IF(測定値入力シート!AF19=\"\",\"\",測定値入力シート!AF19)","v":600},{"$f":"IF(測定値入力シート!AG19=\"\",\"\",測定値入力シート!AG19)","v":1.75},null,600,1.75,348.15143801352104,0.5802523966892017,2.7781512503836434,-0.23638305704740786,{"$f":"IF(E14=\"\",\"\",ROUND($L$14*D14^(-$M$14),2))","v":0.24},null,{"$f":"IF(ISERROR(IF(E5=\"\",\"\",ROUND(L10*(-M10+1),3))),\"\",IF(E5=\"\",\"\",ROUND(L10*(-M10+1),3)))","v":9.8260000000000005},{"$f":"IF(ISERROR(IF(E5=\"\",\"\",ROUND(M10,3))),\"\",IF(E5=\"\",\"\",ROUND(M10,3)))","v":0.57799999999999996},{"$f":"IF(ISERROR(IF(E5=\"\",\"\",ROUND(L14*600^(-M14),2))),\"\",IF(E5=\"\",\"\",ROUND(L14*600^(-M14),2)))","v":0.24}]
[{"$f":"IF(測定値入力シート!AF20=\"\",\"\",測定値入力シート!AF20)","v":""},{"$f":"IF(測定値入力シート!AG20=\"\",\"\",測定値入力シート!AG20)","v":""},null,"","","",{"$f":"IF(E15=\"\",\"\",F15/D15)","v":""},{"$f":"IF(E15=\"\",\"\",LOG(D15,10))","v":""},{"$f":"IF(E15=\"\",\"\",LOG(G15,10))","v":""},""]
[{"$f":"IF(測定値入力シート!AF21=\"\",\"\",測定値入力シート!AF21)","v":""},{"$f":"IF(測定値入力シート!AG21=\"\",\"\",測定値入力シート!AG21)","v":""},null,"","","","","","",""]
[{"$f":"IF(測定値入力シート!AF22=\"\",\"\",測定値入力シート!AF22)","v":""},{"$f":"IF(測定値入力シート!AG22=\"\",\"\",測定値入力シート!AG22)","v":""},null,"","","","","","",""]
[{"$f":"IF(測定値入力シート!AF23=\"\",\"\",測定値入力シート!AF23)","v":""},{"$f":"IF(測定値入力シート!AG23=\"\",\"\",測定値入力シート!AG23)","v":""},null,"","","","","","","",null,1.75]
[{"$f":"IF(測定値入力シート!AF24=\"\",\"\",測定値入力シート!AF24)","v":""},{"$f":"IF(測定値入力シート!AG24=\"\",\"\",測定値入力シート!AG24)","v":""},null,"","","","","","","",null,348.15]
[{"$f":"IF(測定値入力シート!AF25=\"\",\"\",測定値入力シート!AF25)","v":""},{"$f":"IF(測定値入力シート!AG25=\"\",\"\",測定値入力シート!AG25)","v":""},null,"","","","","","","",null,0.31]
{"$rows_left_out":17}